BDBM50135687 (R)-1-((4E,6E)-(2S,3S,8S,9S)-3-Acetylamino-9-methoxy-2,6,8-trimethyl-10-phenyl-deca-4,6-dienoyl)-pyrrolidine-2-carboxylic acid::CHEMBL316507
SMILES CO[C@@H](Cc1ccccc1)[C@@H](C)\C=C(/C)\C=C\[C@H](NC(C)=O)[C@H](C)C(=O)N1CCC[C@@H]1C(O)=O
InChI Key InChIKey=IFWHRSAJDUCTAY-ANFUCANNSA-N
Data  2 IC50
  Tab Delimited (TSV)   2D SDfile   Computed 3D by Vconf -m prep SDfile
Find this compound or compounds like it in BindingDB:
Activity Spreadsheet -- Enzyme Inhibition Constant Data from BindingDB
Found 1 hit for monomerid = 50135687
TargetSerine/threonine-protein phosphatase 2A catalytic subunit alpha isoform(Bos taurus)
University Of California Irvine
Curated by ChEMBL
LigandPNGBDBM50135687((R)-1-((4E,6E)-(2S,3S,8S,9S)-3-Acetylamino-9-metho...)
Affinity DataIC50: >2.50E+4nM. Assay description: Inhibitory concentration against protein phosphatase 2A (PP2A) using pNPP assay
In DepthDetails ArticlePubMed